Boost logo

Boost :

Subject: [boost] [constrained-value] with 1.43.0
From: Neal Becker (ndbecker2_at_[hidden])
Date: 2010-05-06 10:57:22

I found my code using constrained_value compiles with boost-1.42.0, but not
with 1.43.0. Rather mysterious error message:

/usr/local/src/boost.hg/boost/constrained_value/constrained.hpp:64: error:
'template<class ExceptionType> struct
boost::constrained_value::throw_exception' is not a function,
/usr/local/src/boost.hg/boost/throw_exception.hpp:74: error: conflict with
'template<class E> void boost::throw_exception(const E&)'
/usr/local/src/boost.hg/boost/throw_exception.hpp:54: error: in call to
scons: *** [mod/fixed_pt.os] Error 1

Boost list run by bdawes at, gregod at, cpdaniel at, john at