[Boost-bugs] [Boost C++ Libraries] #2559: error C2064 thread.hpp

Subject: [Boost-bugs] [Boost C++ Libraries] #2559: error C2064 thread.hpp
From: Boost C++ Libraries (noreply_at_[hidden])
Date: 2008-12-02 20:12:38

#2559: error C2064 thread.hpp
 Reporter: connor.poske_at_[hidden] | Owner: anthonyw
     Type: Bugs | Status: new
Milestone: To Be Determined | Component: thread
  Version: Boost 1.36.0 | Severity: Problem
 Keywords: |
 I am using Visual Studio 9.0 and Boost libraries 1.36. The program I am
 trying to compile #includes <boost/thread/thread.hpp> and
 <boost/thread/mutex.hpp>. The compiler reports the following error:

 Error 2 error C2064: term does not evaluate to a function taking 0
 arguments D:\software\Boost C++
 Libraries\boost_1_36_0\boost\thread\detail\thread.hpp 56

 This is on line 56 in thread.hpp.

Ticket URL: <https://svn.boost.org/trac/boost/ticket/2559>
Boost C++ Libraries <http://www.boost.org/>
Boost provides free peer-reviewed portable C++ source libraries.

This archive was generated by hypermail 2.1.7 : 2017-02-16 18:49:59 UTC