[Boost-bugs] [Boost C++ Libraries] #7623: make error

Subject: [Boost-bugs] [Boost C++ Libraries] #7623: make error
From: Boost C++ Libraries (noreply_at_[hidden])
Date: 2012-11-01 21:04:15

#7623: make error
 Reporter: jer.oen@… | Owner: vladimir_prus
     Type: Support Requests | Status: new
Milestone: To Be Determined | Component: build
  Version: Boost 1.40.0 | Severity: Problem
 Keywords: |
 cd calpp/trunk
  cmake .
  make install

 I get this error:

 root:abt:~/calpp/trunk# cmake .
  -- ATI CAL cl library directory /usr/lib
  -- ATI CAL rt library directory /usr/lib
  -- Boost version 1_40
  -- Configuring done
  -- Generating done
  -- Build files have been written to: /root/calpp/trunk
  rootiab t: -/calpp/trunk# make
  I 6%] Building CXX object
  In file included from /root/calpp/trunk/examples/coalescingtest.cpp:27: -
  /root/calpp/trunk/include/cal/cal.hpp:442: error: 'mutex' in naiaespace
 'boost' d
  oes not name a type
  /root/calpp/trunk/include/cal/cal.hpp:483: error: expected constructor,
  or, or type conversion before 'CALcontextJielper'
  /root/calpp/trunk/include/cal/cal.hpp:750: error: 'recursivejwtex' in
  'boost' does not name a type
  make[2]: ***
 [examples/CMakeFiles/coalescingtest.dir/coalescingtest.cpp.o] Error
  make(l]: *** [exainples/CMakeFlles/coalescingtest.dir/all] Error 2
  make: *** [all] Error 2

Ticket URL: <https://svn.boost.org/trac/boost/ticket/7623>
Boost C++ Libraries <http://www.boost.org/>
Boost provides free peer-reviewed portable C++ source libraries.

This archive was generated by hypermail 2.1.7 : 2017-02-16 18:50:11 UTC