Boost logo

Boost Users :

Subject: [Boost-users] Error Installing Boost 1.38
From: Amine ABOU MOUGHLBAY (Amine.ABOU_MOUGHLBAY_at_[hidden])
Date: 2010-07-15 08:33:04


I am trying to install the Boost 1.38:
I am on Ubuntu 10.04 LTS machine

I get this error :

/home/aaboumou/profiles/default/install/stable/boost_1_38_0/boost/accumulators/statistics_fwd.hpp: In function ?void
/home/aaboumou/profiles/default/install/stable/boost_1_38_0/boost/accumulators/statistics_fwd.hpp:87: error: ?template<int N> struct boost::accumulators::tag::moment? is not a
/home/aaboumou/profiles/default/install/stable/boost_1_38_0/boost/accumulators/statistics/moment.hpp:104: error: conflict with ?template<int T2, class Arg1, class A0, class A1, class A2, class A3, class A4, class A5, class A6, class A7, class A8, class A9, class A10, class A11, class A12, class A13, class A14> typename boost::accumulators::detail::extractor_result<Arg1, boost::accumulators::tag::moment<T2> >::type boost::accumulators::extract::moment(const Arg1&, const A0&, const A1&, const A2&, const A3&, const A4&, const A5&, const A6&, const A7&, const A8&, const A9&, const A10&, const A11&, const A12&, const A13&, const
/home/aaboumou/profiles/default/install/stable/boost_1_38_0/libs/accumulators/example/main.cpp:63: error: in call to
make[2]: ***
[libs/accumulators/example/CMakeFiles/accumulators-accumulators_example.dir/main.cpp.o] Erreur
make[1]: ***
[libs/accumulators/example/CMakeFiles/accumulators-accumulators_example.dir/all] Erreur
make: *** [all] Erreur 2

Any one have ideas to resolve this error ?

Thanks a lot for your help.

Best Regards

Université Blaise Pascal
Doctorant au LASMEA, UMR 6602 du CNRS
Membre de l'équipe ROSACE du GRAVIR
24, Avenue des Landais - 63177 AUBIERE Cedex

Boost-users list run by williamkempf at, kalb at, bjorn.karlsson at, gregod at, wekempf at